Target
Glutamate receptor ionotropic, NMDA 2B
Ligand
BDBM50220598
Substrate
Meas. Tech.
ChEMBL_457343 (CHEMBL940934)
Ki
11±n/a nM
Citation
 Kawai, MSakurada, IMorita, AIwamuro, YAndo, KOmura, HSakakibara, SMasuda, TKoike, HHonma, THattori, KTakashima, TMizuno, KMizutani, MKawamura, M Structure-activity relationship study of novel NR2B-selective antagonists with arylamides to avoid reactive metabolites formation. Bioorg Med Chem Lett 17:5537-42 (2007)  
Target
Name:
Glutamate receptor ionotropic, NMDA 2B
Synonyms:
GluN2B Grin2b NMDA receptor subunit N2B (GluN2B) NMDE2_RAT | NR2B
Type:
Protein
Mol. Mass.:
166077.66
Organism:
Rattus norvegicus (Rat)
Description:
Q00960
Residue:
1482
  
Inhibitor
Name:
BDBM50220598
Synonyms:
6-oxo-N-(((1s,4s)-4-(2-phenoxyethyl)cyclohexyl)methyl)-1,2,3,6-tetrahydropyridazine-3-carboxamide | CHEMBL251127
Type:
Small organic molecule
Emp. Form.:
C20H27N3O3
Mol. Mass.:
357.4467
SMILES:
O=C(NC[C@@H]1CC[C@H](CCOc2ccccc2)CC1)C1NNC(=O)C=C1
: