Target
Hydroxycarboxylic acid receptor 3
Ligand
BDBM50220853
Substrate
Meas. Tech.
ChEMBL_449369 (CHEMBL899636)
EC50
3230±n/a nM
Citation
 Skinner, PJCherrier, MCWebb, PJShin, YJGharbaoui, TLindstrom, AHong, VTamura, SYDang, HTPride, CCChen, RRichman, JGConnolly, DTSemple, G Fluorinated pyrazole acids are agonists of the high affinity niacin receptor GPR109a. Bioorg Med Chem Lett 17:5620-3 (2007)  
Target
Name:
Hydroxycarboxylic acid receptor 3
Synonyms:
G-protein coupled receptor 109B G-protein coupled receptor HM74B HCA3 HCAR3_HUMAN HM74B NIACR2 Nicotinic acid receptor 2
Type:
Enzyme Catalytic Domain
Mol. Mass.:
44498.06
Organism:
Homo sapiens (Human)
Description:
GPR109B 0 HUMAN::P49019
Residue:
387
  
Inhibitor
Name:
BDBM50220853
Synonyms:
5-(5-cyclopropyl-1H-pyrazol-3-yl)-1H-tetrazole | CHEMBL235230
Type:
Small organic molecule
Emp. Form.:
C7H8N6
Mol. Mass.:
176.1786
SMILES:
C1CC1c1cc(n[nH]1)-c1nnn[nH]1
: