Target
Type-1 angiotensin II receptor A
Ligand
BDBM50221297
Substrate
Meas. Tech.
ChEMBL_457557 (CHEMBL922757)
Ki
>10000±n/a nM
Citation
 Murugaiah, AMWallinder, CMahalingam, AKWu, XWan, YPlouffe, BBotros, MKarlén, AHallberg, MGallo-Payet, NAlterman, M Selective angiotensin II AT(2) receptor agonists devoid of the imidazole ring system. Bioorg Med Chem 15:7166-83 (2007)  
Target
Name:
Type-1 angiotensin II receptor A
Synonyms:
AGTRA_RAT Agtr1 Angiotensin II AT1 Angiotensin II receptor (AT-1) type-1 Type-1A angiotensin II receptor
Type:
Enzyme Catalytic Domain
Mol. Mass.:
40910.53
Organism:
RAT
Description:
ANGIOTENSIN AT1 AGTR1 RAT::P25095
Residue:
359
  
Inhibitor
Name:
BDBM50221297
Synonyms:
CHEMBL239393 butyl 3-(4-(2-(dimethylamino)-2-oxoethyl)phenyl)-5-isobutylthiophen-2-ylsulfonylcarbamate
Type:
Small organic molecule
Emp. Form.:
C23H32N2O5S2
Mol. Mass.:
480.641
SMILES:
CCCCOC(=O)NS(=O)(=O)c1sc(CC(C)C)cc1-c1ccc(CC(=O)N(C)C)cc1
: