Target
Angiopoietin-1 receptor
Ligand
BDBM50221358
Substrate
Meas. Tech.
ChEMBL_449556 (CHEMBL899826)
IC50
114±n/a nM
Citation
 Johnson, NWSemones, MAdams, JLHansbury, MWinkler, J Optimization of triarylimidazoles for Tie2: influence of conformation on potency. Bioorg Med Chem Lett 17:5514-7 (2007)  
Target
Name:
Angiopoietin-1 receptor
Synonyms:
TEK TIE2_HUMAN Tyrosine-protein kinase receptor (TIE-2) Tyrosine-protein kinase receptor TEK (p140 TEK) Tyrosine-protein kinase receptor TIE2/TEK VMCM1 p140 TEK
Type:
Enzyme
Mol. Mass.:
125835.70
Organism:
Homo sapiens (Human)
Description:
Q02763
Residue:
1124
  
Inhibitor
Name:
BDBM50221358
Synonyms:
4-[2-(4-methanesulfonyl-2-methyl-phenyl)-5-(6-methoxy-naphthalen-2-yl)-1-methyl-3H-imidazol-4-yl]-pyridine | CHEMBL237571
Type:
Small organic molecule
Emp. Form.:
C28H25N3O3S
Mol. Mass.:
483.581
SMILES:
COc1ccc2cc(ccc2c1)-c1c(nc(-c2ccc(cc2C)S(C)(=O)=O)n1C)-c1ccncc1
: