Target
Hepatocyte growth factor receptor
Ligand
BDBM50221346
Substrate
Meas. Tech.
ChEMBL_449565 (CHEMBL899835)
IC50
>30000±n/a nM
Citation
 Johnson, NWSemones, MAdams, JLHansbury, MWinkler, J Optimization of triarylimidazoles for Tie2: influence of conformation on potency. Bioorg Med Chem Lett 17:5514-7 (2007)  
Target
Name:
Hepatocyte growth factor receptor
Synonyms:
Hepatocyte growth factor receptor Hepatocyte growth factor receptor (c-MET) MET Met proto-oncogene (hepatocyte growth factor receptor) Tyrosine-protein kinase Met (c-Met) c-Met kinase
Type:
Protein
Mol. Mass.:
155559.73
Organism:
Homo sapiens (Human)
Description:
P08581
Residue:
1390
  
Inhibitor
Name:
BDBM50221346
Synonyms:
4-[2-(4-methanesulfinyl-2-methyl-phenyl)-5-(6-methoxy-naphthalen-2-yl)-1-methyl-3H-imidazol-4-yl]-pyridine | CHEMBL237570
Type:
Small organic molecule
Emp. Form.:
C28H25N3O2S
Mol. Mass.:
467.582
SMILES:
COc1ccc2cc(ccc2c1)-c1c(nc(-c2ccc(cc2C)S(C)=O)n1C)-c1ccncc1
: