Target
Epidermal growth factor receptor
Ligand
BDBM50221515
Substrate
Meas. Tech.
ChEMBL_457644 (CHEMBL923921)
Ki
120±n/a nM
Citation
 Pannala, MKher, SWilson, NGaudette, JSircar, IZhang, SHBakhirev, AYang, GYuen, PGorcsan, FSakurai, NBarbosa, MCheng, JF Synthesis and structure-activity relationship of 4-(2-aryl-cyclopropylamino)-quinoline-3-carbonitriles as EGFR tyrosine kinase inhibitors. Bioorg Med Chem Lett 17:5978-82 (2007)  
Target
Name:
Epidermal growth factor receptor
Synonyms:
EGF Receptor Substrate EGFR_HUMAN ERBB1 Epidermal Growth Factor Receptor erbB-1 Epidermal growth factor receptor (EGFR) HER1 Proto-oncogene c-ErbB-1 Tyrosine-Protein Kinase ErbB-1
Type:
Receptor Kinase Domain
Mol. Mass.:
134279.59
Organism:
Homo sapiens (Human)
Description:
P00533
Residue:
1210
  
Inhibitor
Name:
BDBM50221515
Synonyms:
6-(benzyloxy)-7-methoxy-4-((1R,2S)-2-phenylcyclopropylamino)quinoline-3-carbonitrile | CHEMBL248220
Type:
Small organic molecule
Emp. Form.:
C27H23N3O2
Mol. Mass.:
421.4904
SMILES:
COc1cc2ncc(C#N)c(N[C@@H]3C[C@H]3c3ccccc3)c2cc1OCc1ccccc1
: