Target
Epidermal growth factor receptor
Ligand
BDBM50221533
Substrate
Meas. Tech.
ChEMBL_457644 (CHEMBL923921)
Ki
52±n/a nM
Citation
 Pannala, MKher, SWilson, NGaudette, JSircar, IZhang, SHBakhirev, AYang, GYuen, PGorcsan, FSakurai, NBarbosa, MCheng, JF Synthesis and structure-activity relationship of 4-(2-aryl-cyclopropylamino)-quinoline-3-carbonitriles as EGFR tyrosine kinase inhibitors. Bioorg Med Chem Lett 17:5978-82 (2007)  
Target
Name:
Epidermal growth factor receptor
Synonyms:
EGF Receptor Substrate EGFR_HUMAN ERBB1 Epidermal Growth Factor Receptor erbB-1 Epidermal growth factor receptor (EGFR) HER1 Proto-oncogene c-ErbB-1 Tyrosine-Protein Kinase ErbB-1
Type:
Receptor Kinase Domain
Mol. Mass.:
134279.59
Organism:
Homo sapiens (Human)
Description:
P00533
Residue:
1210
  
Inhibitor
Name:
BDBM50221533
Synonyms:
4-((1R,2S)-2-(3-bromophenyl)cyclopropylamino)-6,7-dimethoxyquinoline-3-carbonitrile | CHEMBL248425
Type:
Small organic molecule
Emp. Form.:
C21H18BrN3O2
Mol. Mass.:
424.291
SMILES:
COc1cc2ncc(C#N)c(N[C@@H]3C[C@H]3c3cccc(Br)c3)c2cc1OC
: