Target
Tyrosine-protein kinase SYK
Ligand
BDBM50221529
Substrate
Meas. Tech.
ChEMBL_457647 (CHEMBL923924)
Ki
300±n/a nM
Citation
 Pannala, MKher, SWilson, NGaudette, JSircar, IZhang, SHBakhirev, AYang, GYuen, PGorcsan, FSakurai, NBarbosa, MCheng, JF Synthesis and structure-activity relationship of 4-(2-aryl-cyclopropylamino)-quinoline-3-carbonitriles as EGFR tyrosine kinase inhibitors. Bioorg Med Chem Lett 17:5978-82 (2007)  
Target
Name:
Tyrosine-protein kinase SYK
Synonyms:
KSYK_HUMAN Spleen Tyrosine Kinase Tyrosine-protein kinase SYK (Syk)
Type:
Enzyme
Mol. Mass.:
72079.99
Organism:
Homo sapiens (Human)
Description:
P43405
Residue:
635
  
Inhibitor
Name:
BDBM50221529
Synonyms:
7-(4-(morpholinomethyl)phenyl)-4-((1R,2S)-2-phenylcyclopropylamino)quinoline-3-carbonitrile | CHEMBL399438
Type:
Small organic molecule
Emp. Form.:
C30H28N4O
Mol. Mass.:
460.5695
SMILES:
N#Cc1cnc2cc(ccc2c1N[C@@H]1C[C@H]1c1ccccc1)-c1ccc(CN2CCOCC2)cc1
: