Target
Proto-oncogene tyrosine-protein kinase Src
Ligand
BDBM50221524
Substrate
Meas. Tech.
ChEMBL_457650 (CHEMBL923927)
Ki
49±n/a nM
Citation
 Pannala, MKher, SWilson, NGaudette, JSircar, IZhang, SHBakhirev, AYang, GYuen, PGorcsan, FSakurai, NBarbosa, MCheng, JF Synthesis and structure-activity relationship of 4-(2-aryl-cyclopropylamino)-quinoline-3-carbonitriles as EGFR tyrosine kinase inhibitors. Bioorg Med Chem Lett 17:5978-82 (2007)  
Target
Name:
Proto-oncogene tyrosine-protein kinase Src
Synonyms:
Calmodulin/Proto-oncogene tyrosine-protein kinase Src Proto-oncogene c-Src SRC SRC_HUMAN V-src sarcoma (Schmidt-Ruppin A-2) viral oncogene homolog (avian) p60-Src | pp60c-src
Type:
Protein
Mol. Mass.:
59838.60
Organism:
Homo sapiens (Human)
Description:
P12931
Residue:
536
  
Inhibitor
Name:
BDBM50221524
Synonyms:
6-methoxy-4-((1R,2S)-2-phenylcyclopropylamino)-7-(3-(pyridin-3-yl)propoxy)quinoline-3-carbonitrile | CHEMBL248391
Type:
Small organic molecule
Emp. Form.:
C28H26N4O2
Mol. Mass.:
450.5316
SMILES:
COc1cc2c(N[C@@H]3C[C@H]3c3ccccc3)c(cnc2cc1OCCCc1cccnc1)C#N
: