Target
Tyrosine-protein kinase SYK
Ligand
BDBM50221531
Substrate
Meas. Tech.
ChEMBL_457647 (CHEMBL923924)
Ki
41±n/a nM
Citation
 Pannala, MKher, SWilson, NGaudette, JSircar, IZhang, SHBakhirev, AYang, GYuen, PGorcsan, FSakurai, NBarbosa, MCheng, JF Synthesis and structure-activity relationship of 4-(2-aryl-cyclopropylamino)-quinoline-3-carbonitriles as EGFR tyrosine kinase inhibitors. Bioorg Med Chem Lett 17:5978-82 (2007)  
Target
Name:
Tyrosine-protein kinase SYK
Synonyms:
KSYK_HUMAN Spleen Tyrosine Kinase Tyrosine-protein kinase SYK (Syk)
Type:
Enzyme
Mol. Mass.:
72079.99
Organism:
Homo sapiens (Human)
Description:
P43405
Residue:
635
  
Inhibitor
Name:
BDBM50221531
Synonyms:
6-methoxy-7-(3-(4-methylpiperazin-1-yl)propoxy)-4-((1R,2S)-2-phenylcyclopropylamino)quinoline-3-carbonitrile | CHEMBL248393
Type:
Small organic molecule
Emp. Form.:
C28H33N5O2
Mol. Mass.:
471.5939
SMILES:
COc1cc2c(N[C@@H]3C[C@H]3c3ccccc3)c(cnc2cc1OCCCN1CCN(C)CC1)C#N
: