Target
Vascular endothelial growth factor receptor 1
Ligand
BDBM50221516
Substrate
Meas. Tech.
ChEMBL_457648 (CHEMBL923925)
Ki
350±n/a nM
Citation
 Pannala, MKher, SWilson, NGaudette, JSircar, IZhang, SHBakhirev, AYang, GYuen, PGorcsan, FSakurai, NBarbosa, MCheng, JF Synthesis and structure-activity relationship of 4-(2-aryl-cyclopropylamino)-quinoline-3-carbonitriles as EGFR tyrosine kinase inhibitors. Bioorg Med Chem Lett 17:5978-82 (2007)  
Target
Name:
Vascular endothelial growth factor receptor 1
Synonyms:
FLT FRT Fms-like tyrosine kinase 1 Tyrosine-protein kinase FRT VEGFR-1 VGFR1_HUMAN Vascular endothelial growth factor receptor 1 (FLT1) Vascular endothelial growth factor receptor 1 and 2 (Flt-1 and KDR) Vascular permeability factor receptor vascular endothelial growth factor/vascular permeability factor receptor
Type:
Receptor Tyrosine Kinase
Mol. Mass.:
150800.23
Organism:
Homo sapiens (Human)
Description:
P17948
Residue:
1338
  
Inhibitor
Name:
BDBM50221516
Synonyms:
6-methoxy-7-(3-morpholinopropoxy)-4-((1R,2S)-2-phenylcyclopropylamino)quinoline-3-carbonitrile | CHEMBL248392
Type:
Small organic molecule
Emp. Form.:
C27H30N4O3
Mol. Mass.:
458.5521
SMILES:
COc1cc2c(N[C@@H]3C[C@H]3c3ccccc3)c(cnc2cc1OCCCN1CCOCC1)C#N
: