Target
Growth hormone secretagogue receptor type 1
Ligand
BDBM50222138
Substrate
Meas. Tech.
ChEMBL_449847 (CHEMBL897911)
EC50
200±n/a nM
Citation
 Hernández, ASCheng, PTMusial, CMSwartz, SGGeorge, RJGrover, GSlusarchyk, DSeethala, RKSmith, MDickinson, KGiupponi, LLonghi, DAFlynn, NMurphy, BJGordon, DABiller, SARobl, JATino, JA Discovery, synthesis, and structure-activity studies of tetrazole based growth hormone secretagogues. Bioorg Med Chem Lett 17:5928-33 (2007)  
Target
Name:
Growth hormone secretagogue receptor type 1
Synonyms:
GH-releasing peptide receptor GHS-R GHSR_HUMAN Ghrelin receptor | Ghrelin receptor 1a (GHS-R1a)
Type:
Receptor
Mol. Mass.:
41334.57
Organism:
Homo sapiens (Human)
Description:
Receptor binding studies use plasma membranes from LLC PK-1 cells transiently transfected with hGHSR1a.
Residue:
366
  
Inhibitor
Name:
BDBM50222138
Synonyms:
(R)-methyl 3-(5-(1-(2-amino-2-methylpropanamido)-2-(1H-indol-3-yl)ethyl)-1H-tetrazol-1-yl)propanoate | CHEMBL235012
Type:
Small organic molecule
Emp. Form.:
C19H25N7O3
Mol. Mass.:
399.4469
SMILES:
COC(=O)CCn1nnnc1[C@@H](Cc1c[nH]c2ccccc12)NC(=O)C(C)(C)N
: