Target
Polyunsaturated fatty acid lipoxygenase ALOX15B
Ligand
BDBM50139862
Substrate
Meas. Tech.
ChEMBL_457827 (CHEMBL924097)
IC50
71000±n/a nM
Citation
 Vasquez-Martinez, YOhri, RVKenyon, VHolman, TRSepúlveda-Boza, S Structure-activity relationship studies of flavonoids as potent inhibitors of human platelet 12-hLO, reticulocyte 15-hLO-1, and prostate epithelial 15-hLO-2. Bioorg Med Chem 15:7408-25 (2007)  
Target
Name:
Polyunsaturated fatty acid lipoxygenase ALOX15B
Synonyms:
15-LOX-2 15-Lipoxygenase-2 (15-LOX-2) ALOX15B Arachidonate 15-lipoxygenase, type II Epithelial 15-lipoxygenase-2 | LX15B_HUMAN
Type:
Protein
Mol. Mass.:
75850.40
Organism:
Homo sapiens (Human)
Description:
Residue:
676
  
Inhibitor
Name:
BDBM50139862
Synonyms:
3-(4-Hydroxy-phenyl)-chroman-6,7-diol CHEMBL8328 | HIR-1
Type:
Small organic molecule
Emp. Form.:
C15H14O4
Mol. Mass.:
258.2693
SMILES:
Oc1ccc(cc1)C1COc2cc(O)c(O)cc2C1
: