Target
Polyunsaturated fatty acid lipoxygenase ALOX12
Ligand
BDBM50009001
Substrate
Meas. Tech.
ChEMBL_457824 (CHEMBL924094)
IC50
860±n/a nM
Citation
 Vasquez-Martinez, YOhri, RVKenyon, VHolman, TRSepúlveda-Boza, S Structure-activity relationship studies of flavonoids as potent inhibitors of human platelet 12-hLO, reticulocyte 15-hLO-1, and prostate epithelial 15-hLO-2. Bioorg Med Chem 15:7408-25 (2007)  
Target
Name:
Polyunsaturated fatty acid lipoxygenase ALOX12
Synonyms:
12-LOX 12LO Arachidonate 12-lipoxygenase LOG12 Platelet 12-lipoxygenase | Platelet-type lipoxygenase 12
Type:
Protein
Mol. Mass.:
75689.18
Organism:
Homo sapiens (Human)
Description:
P18054
Residue:
663
  
Inhibitor
Name:
BDBM50009001
Synonyms:
5,6,7-Trihydroxyflavone Baicalein Baicalein, 8 US10252984, Table 2.33
Type:
Small organic molecule
Emp. Form.:
C15H10O5
Mol. Mass.:
270.2369
SMILES:
Oc1cc2oc(cc(=O)c2c(O)c1O)-c1ccccc1
: