Target
Polyunsaturated fatty acid lipoxygenase ALOX12
Ligand
BDBM50222293
Substrate
Meas. Tech.
ChEMBL_457824 (CHEMBL924094)
IC50
480±n/a nM
Citation
 Vasquez-Martinez, YOhri, RVKenyon, VHolman, TRSepúlveda-Boza, S Structure-activity relationship studies of flavonoids as potent inhibitors of human platelet 12-hLO, reticulocyte 15-hLO-1, and prostate epithelial 15-hLO-2. Bioorg Med Chem 15:7408-25 (2007)  
Target
Name:
Polyunsaturated fatty acid lipoxygenase ALOX12
Synonyms:
12-LOX 12LO Arachidonate 12-lipoxygenase LOG12 Platelet 12-lipoxygenase | Platelet-type lipoxygenase 12
Type:
Protein
Mol. Mass.:
75689.18
Organism:
Homo sapiens (Human)
Description:
P18054
Residue:
663
  
Inhibitor
Name:
BDBM50222293
Synonyms:
4'-chloro-7,8-dihydroxyisoflavone | CHEMBL241814
Type:
Small organic molecule
Emp. Form.:
C15H9ClO4
Mol. Mass.:
288.683
SMILES:
Oc1ccc2c(occ(-c3ccc(Cl)cc3)c2=O)c1O
: