Target
Equilibrative nucleoside transporter 1
Ligand
BDBM50222755
Substrate
Meas. Tech.
ChEMBL_458014 (CHEMBL924283)
Ki
11±n/a nM
Citation
 Gupte, ABuolamwini, JK Novel C2-purine position analogs of nitrobenzylmercaptopurine riboside as human equilibrative nucleoside transporter 1 inhibitors. Bioorg Med Chem 15:7726-37 (2007)  
Target
Name:
Equilibrative nucleoside transporter 1
Synonyms:
ENT1 Equilibrative Nucleoside Transporter 1 (ENT1) Equilibrative nucleoside transporter 1 S29A1_HUMAN Solute carrier family 29 member 1
Type:
Multi-pass membrane protein
Mol. Mass.:
50225.92
Organism:
Homo sapiens (Human)
Description:
Residue:
456
  
Inhibitor
Name:
BDBM50222755
Synonyms:
2-bromo-6-(4-nitrobenzylthio)-9-beta-D-ribofuranosylpurine | CHEMBL239889
Type:
Small organic molecule
Emp. Form.:
C17H16BrN5O6S
Mol. Mass.:
498.308
SMILES:
OC[C@H]1O[C@H]([C@H](O)[C@@H]1O)n1cnc2c(SCc3ccc(cc3)[N+]([O-])=O)nc(Br)nc12
: