Target
Caspase-6
Ligand
BDBM50223100
Substrate
Meas. Tech.
ChEMBL_450041 (CHEMBL899136)
IC50
61±n/a nM
Citation
 Wang, YJia, STseng, BDrewe, JCai, SX Dipeptidyl aspartyl fluoromethylketones as potent caspase inhibitors: peptidomimetic replacement of the P(2) amino acid by 2-aminoaryl acids and other non-natural amino acids. Bioorg Med Chem Lett 17:6178-82 (2007)  
Target
Name:
Caspase-6
Synonyms:
Apoptotic protease Mch-2 CASP6 Caspase | MCH2
Type:
Enzyme
Mol. Mass.:
33312.62
Organism:
Homo sapiens (Human)
Description:
P55212
Residue:
293
  
Inhibitor
Name:
BDBM50223100
Synonyms:
2-(2-((S)-2-(benzyloxycarbonyl)-3-methylbutanamido)benzamido)-4-fluoro-3-oxobutanoic acid | CHEMBL237310
Type:
Small organic molecule
Emp. Form.:
C24H26FN3O7
Mol. Mass.:
487.4775
SMILES:
CC(C)[C@H](NC(=O)OCc1ccccc1)C(=O)Nc1ccccc1C(=O)NC(C(O)=O)C(=O)CF
: