Target
Cytochrome P450 3A4
Ligand
BDBM50223243
Substrate
Meas. Tech.
ChEMBL_458143 (CHEMBL925475)
IC50
300±n/a nM
Citation
 Li, HAsberom, TBara, TAClader, JWGreenlee, WJJosien, HBMcBriar, MDNomeir, APissarnitski, DARajagopalan, MXu, RZhao, ZSong, LZhang, L Discovery of 2,4,6-trisubstituted N-arylsulfonyl piperidines as gamma-secretase inhibitors. Bioorg Med Chem Lett 17:6290-4 (2007)  
Target
Name:
Cytochrome P450 3A4
Synonyms:
Albendazole monooxygenase CP3A4_HUMAN CYP3A4 CYPIIIA4 Cytochrome P450 3A4 (CYP3A4) Nifedipine oxidase Taurochenodeoxycholate 6-alpha-hydroxylase
Type:
Enzyme
Mol. Mass.:
57349.57
Organism:
Homo sapiens (Human)
Description:
Residue:
503
  
Inhibitor
Name:
BDBM50223243
Synonyms:
((2R,6S)-1-(4-chlorophenylsulfonyl)-6-isopropylpiperidin-2-yl)methyl 4-(2-hydroxyethyl)piperazine-1-carboxylate | CHEMBL248880
Type:
Small organic molecule
Emp. Form.:
C22H34ClN3O5S
Mol. Mass.:
488.04
SMILES:
CC(C)[C@@H]1CCC[C@H](COC(=O)N2CCN(CCO)CC2)N1S(=O)(=O)c1ccc(Cl)cc1
: