Target
5-hydroxytryptamine receptor 6
Ligand
BDBM50223281
Substrate
Meas. Tech.
ChEMBL_458154 (CHEMBL924411)
Ki
12±n/a nM
Citation
 Tasler, SKraus, JWuzik, AMüller, OAschenbrenner, ACubero, EPascual, RQuintana-Ruiz, JRDordal, AMercè, RCodony, X Discovery of 5-HT6 receptor ligands based on virtual HTS. Bioorg Med Chem Lett 17:6224-9 (2007)  
Target
Name:
5-hydroxytryptamine receptor 6
Synonyms:
5-HT-6 5-hydroxytryptamine receptor 6 (5-HT-6) 5-hydroxytryptamine receptor 6 (5HT6) HTR6 Serotonin 6 (5-HT6) receptor | Serotonin Receptor 6
Type:
G Protein-Coupled Receptor (GPCR)
Mol. Mass.:
46968.43
Organism:
Homo sapiens (Human)
Description:
P50406
Residue:
440
  
Inhibitor
Name:
BDBM50223281
Synonyms:
5-(4-methylpiperazin-1-yl)-2-nitro-N-(1-phenylethyl)benzenamine | CHEMBL400704
Type:
Small organic molecule
Emp. Form.:
C19H24N4O2
Mol. Mass.:
340.4195
SMILES:
CC(Nc1cc(ccc1[N+]([O-])=O)N1CCN(C)CC1)c1ccccc1
: