Target
Cathepsin K
Ligand
BDBM50223923
Substrate
Meas. Tech.
ChEMBL_458256 (CHEMBL924502)
IC50
15±n/a nM
Citation
 Teno, NMiyake, TEhara, TIrie, OSakaki, JOhmori, OGunji, HMatsuura, NMasuya, KHitomi, YNonomura, KHoriuchi, MGohda, KIwasaki, AUmemura, ITada, SKometani, MIwasaki, GCowan-Jacob, SWMissbach, MLattmann, RBetschart, C Novel scaffold for cathepsin K inhibitors. Bioorg Med Chem Lett 17:6096-100 (2007)  
Target
Name:
Cathepsin K
Synonyms:
CATK_HUMAN CTSO Cathepsin O Cathepsin X
Type:
Enzyme
Mol. Mass.:
36975.68
Organism:
Homo sapiens (Human)
Description:
P43235
Residue:
329
  
Inhibitor
Name:
BDBM50223923
Synonyms:
6-benzyl-7-cyclohexyl-7H-pyrrolo[2,3-d]pyrimidine-2-carbonitrile | CHEMBL249157
Type:
Small organic molecule
Emp. Form.:
C20H20N4
Mol. Mass.:
316.3996
SMILES:
N#Cc1ncc2cc(Cc3ccccc3)n(C3CCCCC3)c2n1
: