Target
Muscarinic acetylcholine receptor M3
Ligand
BDBM50223970
Substrate
Meas. Tech.
ChEMBL_450373 (CHEMBL900657)
IC50
16±n/a nM
Citation
 Lainé, DIXie, HBuffet, NFoley, JJBuckley, PWebb, EFWiddowson, KLPalovich, MRBelmonte, KE Discovery of novel 8-azoniabicyclo[3.2.1]octane carbamates as muscarinic acetylcholine receptor antagonists. Bioorg Med Chem Lett 17:6066-9 (2007)  
Target
Name:
Muscarinic acetylcholine receptor M3
Synonyms:
ACM3_HUMAN Cholinergic, muscarinic M3 Muscarinic receptor M3 | RecName: Full=Muscarinic acetylcholine receptor M3
Type:
Enzyme
Mol. Mass.:
66151.03
Organism:
Homo sapiens (Human)
Description:
P20309
Residue:
590
  
Inhibitor
Name:
BDBM50223970
Synonyms:
3-(furan-3-ylmethyl-phenyl-carbamoyloxy)-8,8-dimethyl-8-azonia-bicyclo[3.2.1]octane; bromide | CHEMBL237740
Type:
Small organic molecule
Emp. Form.:
C21H27N2O3
Mol. Mass.:
355.4501
SMILES:
C[N+]1(C)C2CCC1CC(C2)OC(=O)N(Cc1ccoc1)c1ccccc1
: