Target
Muscarinic acetylcholine receptor M2
Ligand
BDBM50223977
Substrate
Meas. Tech.
ChEMBL_450372 (CHEMBL900655)
IC50
1364.1±n/a nM
Citation
 Lainé, DIXie, HBuffet, NFoley, JJBuckley, PWebb, EFWiddowson, KLPalovich, MRBelmonte, KE Discovery of novel 8-azoniabicyclo[3.2.1]octane carbamates as muscarinic acetylcholine receptor antagonists. Bioorg Med Chem Lett 17:6066-9 (2007)  
Target
Name:
Muscarinic acetylcholine receptor M2
Synonyms:
ACM2_HUMAN Cholinergic, muscarinic M2 Muscarinic acetylcholine receptor M2 and M5 | RecName: Full=Muscarinic acetylcholine receptor M2
Type:
GPCR
Mol. Mass.:
51730.61
Organism:
Homo sapiens (Human)
Description:
P08172
Residue:
466
  
Inhibitor
Name:
BDBM50223977
Synonyms:
8-methyl-8-aza-bicyclo[3.2.1]octan-3-yl 4-methoxybenzyl(phenyl)carbamate | CHEMBL429270
Type:
Small organic molecule
Emp. Form.:
C23H28N2O3
Mol. Mass.:
380.48
SMILES:
COc1ccc(CN(C(=O)OC2CC3CCC(C2)N3C)c2ccccc2)cc1
: