Target
Tyrosine-protein kinase ABL1
Ligand
BDBM50225370
Substrate
Meas. Tech.
ChEMBL_451331 (CHEMBL901542)
IC50
9.1±n/a nM
Citation
 Veach, DRNamavari, MPillarsetty, NSantos, EBBeresten-Kochetkov, TLambek, CPunzalan, BJAntczak, CSmith-Jones, PMDjaballah, HClarkson, BLarson, SM Synthesis and biological evaluation of a fluorine-18 derivative of dasatinib. J Med Chem 50:5853-7 (2007)  
Target
Name:
Tyrosine-protein kinase ABL1
Synonyms:
ABL ABL1_HUMAN JTK7 Proto-oncogene tyrosine-protein kinase ABL1 Tyrosine-protein kinase ABL V-abl Abelson murine leukemia viral oncogene homolog 1 p150 | tyrosine-protein kinase ABL1 isoform a
Type:
Enzyme
Mol. Mass.:
122897.30
Organism:
Homo sapiens (Human)
Description:
P00519
Residue:
1130
  
Inhibitor
Name:
BDBM50225370
Synonyms:
CHEMBL240158 SKI-249380
Type:
Small organic molecule
Emp. Form.:
C22H25ClFN7OS
Mol. Mass.:
489.997
SMILES:
Cc1nc(Nc2ncc(s2)C(=O)Nc2c(C)cccc2Cl)cc(n1)N1CCN(CCF)CC1
: