Target
C-X-C chemokine receptor type 4
Ligand
BDBM50225415
Substrate
Meas. Tech.
ChEMBL_451383 (CHEMBL901586)
EC50
0.3±n/a nM
Citation
 Zhan, WLiang, ZZhu, AKurtkaya, SShim, HSnyder, JPLiotta, DC Discovery of small molecule CXCR4 antagonists. J Med Chem 50:5655-64 (2007)  
Target
Name:
C-X-C chemokine receptor type 4
Synonyms:
C-X-C chemokine receptor type 4 CD_antigen=CD184 CXCR-4 CXCR4_HUMAN Fusin LCR1 Leukocyte-derived seven transmembrane domain receptor SDF-1 receptor | Stromal cell-derived factor 1 receptor
Type:
Enzyme
Mol. Mass.:
39754.61
Organism:
Homo sapiens (Human)
Description:
P61073
Residue:
352
  
Inhibitor
Name:
BDBM50225415
Synonyms:
CHEMBL237830 US9205085, MSX- 121 | WZ-811
Type:
Small organic molecule
Emp. Form.:
C18H18N4
Mol. Mass.:
290.3623
SMILES:
C(Nc1ccccn1)c1ccc(CNc2ccccn2)cc1
: