Target
Carboxypeptidase B2
Ligand
BDBM50226605
Substrate
Meas. Tech.
ChEMBL_452077 (CHEMBL901238)
Ki
46±n/a nM
Citation
 Bunnage, MEBlagg, JSteele, JOwen, DRAllerton, CMcElroy, ABMiller, DRinger, TButcher, KBeaumont, KEvans, KGray, AJHolland, SJFeeder, NMoore, RSBrown, DG Discovery of potent& selective inhibitors of activated thrombin-activatable fibrinolysis inhibitor for the treatment of thrombosis. J Med Chem 50:6095-103 (2007)  
Target
Name:
Carboxypeptidase B2
Synonyms:
CBPB2_HUMAN CPU Carboxypeptidase B2 isoform A Plasma carboxypeptidase B Thrombin-activable fibrinolysis inhibitor | pCPB
Type:
Enzyme
Mol. Mass.:
48432.74
Organism:
Homo sapiens (Human)
Description:
Q96IY4
Residue:
423
  
Inhibitor
Name:
BDBM50226605
Synonyms:
(+/-)-5-amino-2-((1-propyl-1H-imidazol-4-yl)methyl)pentanoic acid | CHEMBL395892
Type:
Small organic molecule
Emp. Form.:
C12H21N3O2
Mol. Mass.:
239.314
SMILES:
CCCn1cnc(CC(CCCN)C(O)=O)c1
: