Target
NAD(P)H dehydrogenase [quinone] 1
Ligand
BDBM50055695
Substrate
Meas. Tech.
ChEMBL_452278 (CHEMBL901433)
IC50
20000±n/a nM
Citation
 Nolan, KAZhao, HFaulder, PFFrenkel, ADTimson, DJSiegel, DRoss, DBurke, TRStratford, IJBryce, RA Coumarin-based inhibitors of human NAD(P)H:quinone oxidoreductase-1. Identification, structure-activity, off-target effects and in vitro human pancreatic cancer toxicity. J Med Chem 50:6316-25 (2007)  
Target
Name:
NAD(P)H dehydrogenase [quinone] 1
Synonyms:
Azoreductase DT-diaphorase NAD(P)H:quinone oxidoreductase 1 NQO1 Phylloquinone reductase Quinone Reductase 1 | Quinone reductase 1)
Type:
Homodimer
Mol. Mass.:
30874.82
Organism:
Homo sapiens (Human)
Description:
Residue:
274
  
Inhibitor
Name:
BDBM50055695
Synonyms:
3-[4-dimethylaminophenyl(4-hydroxy-2-oxo-2H-3-chromenyl)methyl]-4-hydroxy-2H-2-chromenone CHEMBL312008 | Dicoumarol derivative, 6
Type:
Small organic molecule
Emp. Form.:
C27H21NO6
Mol. Mass.:
455.4587
SMILES:
CN(C)c1ccc(cc1)C(c1c(O)c2ccccc2oc1=O)c1c(O)c2ccccc2oc1=O
: