Target
NAD(P)H dehydrogenase [quinone] 1
Ligand
BDBM50055693
Substrate
Meas. Tech.
ChEMBL_452277 (CHEMBL901432)
IC50
35000±n/a nM
Citation
 Nolan, KAZhao, HFaulder, PFFrenkel, ADTimson, DJSiegel, DRoss, DBurke, TRStratford, IJBryce, RA Coumarin-based inhibitors of human NAD(P)H:quinone oxidoreductase-1. Identification, structure-activity, off-target effects and in vitro human pancreatic cancer toxicity. J Med Chem 50:6316-25 (2007)  
Target
Name:
NAD(P)H dehydrogenase [quinone] 1
Synonyms:
Azoreductase DT-diaphorase NAD(P)H:quinone oxidoreductase 1 NQO1 Phylloquinone reductase Quinone Reductase 1 | Quinone reductase 1)
Type:
Homodimer
Mol. Mass.:
30874.82
Organism:
Homo sapiens (Human)
Description:
Residue:
274
  
Inhibitor
Name:
BDBM50055693
Synonyms:
4-hydroxy-3-[4-hydroxy-2-oxo-2H-3-chromenyl(4-hydroxyphenyl)methyl]-2H-2-chromenone CHEMBL391292
Type:
Small organic molecule
Emp. Form.:
C25H16O7
Mol. Mass.:
428.3903
SMILES:
Oc1ccc(cc1)C(c1c(O)c2ccccc2oc1=O)c1c(O)c2ccccc2oc1=O
: