Target
NAD(P)H dehydrogenase [quinone] 1
Ligand
BDBM50055694
Substrate
Meas. Tech.
ChEMBL_452278 (CHEMBL901433)
IC50
140±n/a nM
Citation
 Nolan, KAZhao, HFaulder, PFFrenkel, ADTimson, DJSiegel, DRoss, DBurke, TRStratford, IJBryce, RA Coumarin-based inhibitors of human NAD(P)H:quinone oxidoreductase-1. Identification, structure-activity, off-target effects and in vitro human pancreatic cancer toxicity. J Med Chem 50:6316-25 (2007)  
Target
Name:
NAD(P)H dehydrogenase [quinone] 1
Synonyms:
Azoreductase DT-diaphorase NAD(P)H:quinone oxidoreductase 1 NQO1 Phylloquinone reductase Quinone Reductase 1 | Quinone reductase 1)
Type:
Homodimer
Mol. Mass.:
30874.82
Organism:
Homo sapiens (Human)
Description:
Residue:
274
  
Inhibitor
Name:
BDBM50055694
Synonyms:
4-hydroxy-3-[4-hydroxy-2-oxo-2H-3-chromenyl(2-naphthyl)methyl]-2H-2-chromenone | CHEMBL316387
Type:
Small organic molecule
Emp. Form.:
C29H18O6
Mol. Mass.:
462.4496
SMILES:
Oc1c(C(c2ccc3ccccc3c2)c2c(O)c3ccccc3oc2=O)c(=O)oc2ccccc12
: