Target
NAD(P)H dehydrogenase [quinone] 1
Ligand
BDBM50055708
Substrate
Meas. Tech.
ChEMBL_452278 (CHEMBL901433)
IC50
650±n/a nM
Citation
 Nolan, KAZhao, HFaulder, PFFrenkel, ADTimson, DJSiegel, DRoss, DBurke, TRStratford, IJBryce, RA Coumarin-based inhibitors of human NAD(P)H:quinone oxidoreductase-1. Identification, structure-activity, off-target effects and in vitro human pancreatic cancer toxicity. J Med Chem 50:6316-25 (2007)  
Target
Name:
NAD(P)H dehydrogenase [quinone] 1
Synonyms:
Azoreductase DT-diaphorase NAD(P)H:quinone oxidoreductase 1 NQO1 Phylloquinone reductase Quinone Reductase 1 | Quinone reductase 1)
Type:
Homodimer
Mol. Mass.:
30874.82
Organism:
Homo sapiens (Human)
Description:
Residue:
274
  
Inhibitor
Name:
BDBM50055708
Synonyms:
4-hydroxy-3-[4-hydroxy-3-methoxyphenyl(4-hydroxy-2-oxo-2H-3-chromenyl)methyl]-2H-2-chromenone CHEMBL83968
Type:
Small organic molecule
Emp. Form.:
C26H18O8
Mol. Mass.:
458.4163
SMILES:
COc1cc(ccc1O)C(c1c(O)c2ccccc2oc1=O)c1c(O)c2ccccc2oc1=O
: