Target
C-X-C chemokine receptor type 2
Ligand
BDBM50227011
Substrate
Meas. Tech.
ChEMBL_461466 (CHEMBL927478)
Ki
9±n/a nM
Citation
 Biju, PTaveras, AYu, YZheng, JChao, JRindgen, DJakway, JHipkin, RWFossetta, JFan, XFine, JQiu, HMerritt, JRBaldwin, JJ 3,4-Diamino-2,5-thiadiazole-1-oxides as potent CXCR2/CXCR1 antagonists. Bioorg Med Chem Lett 18:228-31 (2008)  
Target
Name:
C-X-C chemokine receptor type 2
Synonyms:
C-X-C chemokine receptor type 2 (CXCR-2) CD_antigen=CD182 CXCR-2 CXCR2_HUMAN GRO/MGSA receptor IL-8 receptor type 2 IL8RB | Interleukin-8 receptor B
Type:
Protein
Mol. Mass.:
40767.88
Organism:
Homo sapiens (Human)
Description:
P25025
Residue:
360
  
Inhibitor
Name:
BDBM50227011
Synonyms:
3-{4-[(R)-1-(5-chloro-furan-2-yl)-2,2-dimethyl-propylamino]-1,1-dioxo-1H-1lambda6-[1,2,5]thiadiazol-3-ylamino}-2-hydroxy-N,N-dimethyl-benzamide | CHEMBL403023
Type:
Small organic molecule
Emp. Form.:
C20H24ClN5O5S
Mol. Mass.:
481.953
SMILES:
CN(C)C(=O)c1cccc(N=C2NS(=O)(=O)N=C2N[C@@H](c2ccc(Cl)o2)C(C)(C)C)c1O
: