Target
Oxysterols receptor LXR-beta
Ligand
BDBM50227160
Substrate
Meas. Tech.
ChEMBL_461472 (CHEMBL927483)
IC50
5±n/a nM
Citation
 Hu, BQuinet, EUnwalla, RCollini, MJetter, JDooley, RAndraka, DNogle, LSavio, DHalpern, AGoos-Nilsson, AWilhelmsson, ANambi, PWrobel, J Carboxylic acid based quinolines as liver X receptor modulators that have LXRbeta receptor binding selectivity. Bioorg Med Chem Lett 18:54-9 (2008)  
Target
Name:
Oxysterols receptor LXR-beta
Synonyms:
LXRB Liver X, LXR beta NR1H2 Nuclear receptor NER Ubiquitously-expressed nuclear receptor
Type:
Enzyme Catalytic Domain
Mol. Mass.:
50978.79
Organism:
Homo sapiens (Human)
Description:
P55055
Residue:
460
  
Inhibitor
Name:
BDBM50227160
Synonyms:
2-(4-((3-(3-benzoyl-8-(trifluoromethyl)quinolin-5-yl)phenoxy)methyl)phenyl)pent-4-enoic acid | CHEMBL403958
Type:
Small organic molecule
Emp. Form.:
C35H26F3NO4
Mol. Mass.:
581.5804
SMILES:
OC(=O)C(CC=C)c1ccc(COc2cccc(c2)-c2ccc(c3ncc(cc23)C(=O)c2ccccc2)C(F)(F)F)cc1
: