Target
Peroxisome proliferator-activated receptor gamma
Ligand
BDBM50227151
Substrate
Meas. Tech.
ChEMBL_461488 (CHEMBL927499)
EC50
84±n/a nM
Citation
 Hu, BQuinet, EUnwalla, RCollini, MJetter, JDooley, RAndraka, DNogle, LSavio, DHalpern, AGoos-Nilsson, AWilhelmsson, ANambi, PWrobel, J Carboxylic acid based quinolines as liver X receptor modulators that have LXRbeta receptor binding selectivity. Bioorg Med Chem Lett 18:54-9 (2008)  
Target
Name:
Peroxisome proliferator-activated receptor gamma
Synonyms:
NR1C3 PPAR-gamma PPARG_HUMAN Peroxisome proliferator-activated receptor gamma (PPAR gamma) Peroxisome proliferator-activated receptor gamma (PPARĪ³) peroxisome proliferator-activated receptor gamma isoform 2
Type:
Nuclear Receptor
Mol. Mass.:
57613.46
Organism:
Homo sapiens (Human)
Description:
P37231
Residue:
505
  
Inhibitor
Name:
BDBM50227151
Synonyms:
2-(5-(3-(3-benzyl-8-(trifluoromethyl)quinolin-4-yl)benzylamino)naphthalen-1-yl)acetic acid | CHEMBL253311
Type:
Small organic molecule
Emp. Form.:
C36H27F3N2O2
Mol. Mass.:
576.607
SMILES:
OC(=O)Cc1cccc2c(NCc3cccc(c3)-c3c(Cc4ccccc4)cnc4c(cccc34)C(F)(F)F)cccc12
: