Target
Phenylethanolamine N-methyltransferase
Ligand
BDBM50227503
Substrate
Meas. Tech.
ChEMBL_461584 (CHEMBL927607)
Ki
67±n/a nM
Citation
 Grunewald, GLSeim, MRBhat, SRWilson, MECriscione, KR Synthesis of 4,5,6,7-tetrahydrothieno[3,2-c]pyridines and comparison with their isosteric 1,2,3,4-tetrahydroisoquinolines as inhibitors of phenylethanolamine N-methyltransferase. Bioorg Med Chem 16:542-59 (2008)  
Target
Name:
Phenylethanolamine N-methyltransferase
Synonyms:
Noradrenaline N-methyltransferase PNMT_BOVIN | PNMTase
Type:
Enzyme
Mol. Mass.:
30916.97
Organism:
Bos taurus (bovine)
Description:
Residue:
283
  
Inhibitor
Name:
BDBM50227503
Synonyms:
3-Methyl-1,2,3,4-tetrahydro-benzo[4,5]thieno[3,2-c]pyridine SK&F-7698 | SK-7698
Type:
Small organic molecule
Emp. Form.:
C12H13NS
Mol. Mass.:
203.303
SMILES:
CC1Cc2sc3ccccc3c2CN1
: