Target
Peroxisome proliferator-activated receptor alpha
Ligand
BDBM50227764
Substrate
Meas. Tech.
ChEMBL_452360 (CHEMBL902599)
EC50
544±n/a nM
Citation
 Shi, QCanada, EJXu, YWarshawsky, AMEtgen, GJBroderick, CLClutinger, CKIrwin, LALaurila, MEMontrose-Rafizadeh, COldham, BAWang, MWinneroski, LLXie, CYork, JSYumibe, NPZink, RWMantlo, N Design and synthesis of novel and potent amide linked PPARgamma/delta dual agonists. Bioorg Med Chem Lett 17:6744-9 (2008)  
Target
Name:
Peroxisome proliferator-activated receptor alpha
Synonyms:
NR1C1 PPAR PPAR-alpha PPARA_HUMAN Peroxisome proliferator-activated receptor | Peroxisome proliferator-activated receptor alpha (PPAR alpha)
Type:
Enzyme
Mol. Mass.:
52222.08
Organism:
Homo sapiens (Human)
Description:
Q07869
Residue:
468
  
Inhibitor
Name:
BDBM50227764
Synonyms:
2-(4-(3-((2-fluoro-4-(trifluoromethyl)benzamido)methyl)-5-methylphenoxy)-2-methylphenoxy)-2-methylpropanoic acid | CHEMBL237518
Type:
Small organic molecule
Emp. Form.:
C27H25F4NO5
Mol. Mass.:
519.4847
SMILES:
Cc1cc(CNC(=O)c2ccc(cc2F)C(F)(F)F)cc(Oc2ccc(OC(C)(C)C(O)=O)c(C)c2)c1
: