Target
Cytochrome P450 2D6
Ligand
BDBM50198392
Substrate
Meas. Tech.
ChEMBL_461650 (CHEMBL928768)
Ki
5000±n/a nM
Citation
 Watson, RJAllen, DRBirch, HLChapman, GAGalvin, FCJopling, LAKnight, RLMeier, DOliver, KMeissner, JWOwen, DAThomas, EJTremayne, NWilliams, SC Development of CXCR3 antagonists. Part 3: Tropenyl and homotropenyl-piperidine urea derivatives. Bioorg Med Chem Lett 18:147-51 (2008)  
Target
Name:
Cytochrome P450 2D6
Synonyms:
CP2D6_HUMAN CYP2DL1 Cytochrome P450 2D6 (CYP2D6) P450-DB1
Type:
Protein
Mol. Mass.:
55774.82
Organism:
Homo sapiens (Human)
Description:
P10635
Residue:
497
  
Inhibitor
Name:
BDBM50198392
Synonyms:
1-(3,5-bis(trifluoromethyl)phenyl)-3-(1-(((1R,5S)-6,6-dimethylbicyclo[3.1.1]hept-2-en-2-yl)methyl)piperidin-4-yl)urea | CHEMBL439399
Type:
Small organic molecule
Emp. Form.:
C24H29F6N3O
Mol. Mass.:
489.497
SMILES:
CC1(C)[C@@H]2C[C@H]1C(CN1CCC(CC1)NC(=O)Nc1cc(cc(c1)C(F)(F)F)C(F)(F)F)=CC2
: