Target
C-X-C chemokine receptor type 3
Ligand
BDBM50227868
Substrate
Meas. Tech.
ChEMBL_461631 (CHEMBL928749)
Ki
60±n/a nM
Citation
 Watson, RJAllen, DRBirch, HLChapman, GAGalvin, FCJopling, LAKnight, RLMeier, DOliver, KMeissner, JWOwen, DAThomas, EJTremayne, NWilliams, SC Development of CXCR3 antagonists. Part 3: Tropenyl and homotropenyl-piperidine urea derivatives. Bioorg Med Chem Lett 18:147-51 (2008)  
Target
Name:
C-X-C chemokine receptor type 3
Synonyms:
AAO92295.1 C-X-C chemokine receptor type 3 (CXCR3) CXCR3 CXCR3_HUMAN chemokine (C-X-C motif) receptor 3
Type:
Enzyme Catalytic Domain
Mol. Mass.:
40665.65
Organism:
Homo sapiens (Human)
Description:
Residue:
368
  
Inhibitor
Name:
BDBM50227868
Synonyms:
1-(3,5-bis(trifluoromethyl)phenyl)-3-(1-((1-pivaloylpiperidin-4-yl)methyl)piperidin-4-yl)urea | CHEMBL252503
Type:
Small organic molecule
Emp. Form.:
C25H34F6N4O2
Mol. Mass.:
536.5535
SMILES:
CC(C)(C)C(=O)N1CCC(CN2CCC(CC2)NC(=O)Nc2cc(cc(c2)C(F)(F)F)C(F)(F)F)CC1
: