Target
Glucocorticoid receptor
Ligand
BDBM50228079
Substrate
Meas. Tech.
ChEMBL_452393 (CHEMBL902629)
Ki
167±n/a nM
Citation
 Bell, MGGernert, DLGrese, TABelvo, MDBorromeo, PSKelley, SAKennedy, JHKolis, SPLander, PARichey, RSharp, VSStephenson, GAWilliams, JDYu, HZimmerman, KMSteinberg, MIJadhav, PK (S)-N-{3-[1-cyclopropyl-1-(2,4-difluoro-phenyl)-ethyl]-1H-indol-7-yl}-methanesulfonamide: a potent, nonsteroidal, functional antagonist of the mineralocorticoid receptor. J Med Chem 50:6443-5 (2007)  
Target
Name:
Glucocorticoid receptor
Synonyms:
GCR_HUMAN GRL Glucocorticoid receptor (GRFP) Nuclear receptor subfamily 3 group C member 1
Type:
Enzyme
Mol. Mass.:
85656.87
Organism:
Homo sapiens (Human)
Description:
P04150
Residue:
777
  
Inhibitor
Name:
BDBM50228079
Synonyms:
(R)-N-(3-(1-cyclopropyl-1-(4-fluorophenyl)ethyl)-1H-indol-7-yl)methanesulfonamide | CHEMBL235209
Type:
Small organic molecule
Emp. Form.:
C20H21FN2O2S
Mol. Mass.:
372.456
SMILES:
C[C@](C1CC1)(c1c[nH]c2c(NS(C)(=O)=O)cccc12)c1ccc(F)cc1
: