Target
Estrogen receptor
Ligand
BDBM50228077
Substrate
Meas. Tech.
ChEMBL_452396 (CHEMBL902632)
Ki
>1100±n/a nM
Citation
 Bell, MGGernert, DLGrese, TABelvo, MDBorromeo, PSKelley, SAKennedy, JHKolis, SPLander, PARichey, RSharp, VSStephenson, GAWilliams, JDYu, HZimmerman, KMSteinberg, MIJadhav, PK (S)-N-{3-[1-cyclopropyl-1-(2,4-difluoro-phenyl)-ethyl]-1H-indol-7-yl}-methanesulfonamide: a potent, nonsteroidal, functional antagonist of the mineralocorticoid receptor. J Med Chem 50:6443-5 (2007)  
Target
Name:
Estrogen receptor
Synonyms:
ER ESR ESR1_HUMAN Estrogen receptor Estrogen receptor (ER-alpha) Estrogen receptor alpha (ER) Nuclear receptor subfamily 3 group A member 1
Type:
Protein
Mol. Mass.:
66230.44
Organism:
Homo sapiens (Human)
Description:
P03372
Residue:
595
  
Inhibitor
Name:
BDBM50228077
Synonyms:
CHEMBL237122 | epierenone
Type:
Small organic molecule
Emp. Form.:
C24H30O6
Mol. Mass.:
414.4914
SMILES:
COC(=O)[C@@H]1CC2=CC(=O)CC[C@]2(C)C2[C@@H]3O[C@@H]3[C@@]3(C)C(CC[C@@]33CCC(=O)O3)C12
: