Target
Sodium-dependent serotonin transporter
Ligand
BDBM50228439
Substrate
Meas. Tech.
ChEMBL_452611 (CHEMBL902862)
Ki
0.05±n/a nM
Citation
 Parhi, AKWang, JLOya, SChoi, SRKung, MPKung, HF 2-(2'-((dimethylamino)methyl)-4'-(fluoroalkoxy)-phenylthio)benzenamine derivatives as serotonin transporter imaging agents. J Med Chem 50:6673-84 (2007)  
Target
Name:
Sodium-dependent serotonin transporter
Synonyms:
5-HT Transporter 5HTT SC6A4_HUMAN SLC6A4 Serotonin transporter (5HTT) Sodium-dependent serotonin transporter (SERT) | Solute carrier family 6 member 4
Type:
Multi-pass membrane protein
Mol. Mass.:
70322.51
Organism:
Homo sapiens (Human)
Description:
P31645
Residue:
630
  
Inhibitor
Name:
BDBM50228439
Synonyms:
5-bromo-2-(2-((dimethylamino)methyl)-4-(2-fluoroethoxy)phenylthio)benzenamine | CHEMBL239297
Type:
Small organic molecule
Emp. Form.:
C17H20BrFN2OS
Mol. Mass.:
399.321
SMILES:
CN(C)Cc1cc(OCCF)ccc1Sc1ccc(Br)cc1N
: