Target
5-hydroxytryptamine receptor 1A
Ligand
BDBM50228648
Substrate
Meas. Tech.
ChEMBL_461682 (CHEMBL927703)
Ki
>10000±n/a nM
Citation
 Seong, CMPark, WKPark, CMKong, JYPark, NS Discovery of 3-aryl-3-methyl-1H-quinoline-2,4-diones as a new class of selective 5-HT6 receptor antagonists. Bioorg Med Chem Lett 18:738-43 (2008)  
Target
Name:
5-hydroxytryptamine receptor 1A
Synonyms:
5-HT-1A 5-hydroxytryptamine receptor 1A (5-HT-1A) ADRB2RL1 Dopamine D2 receptor and serotonin 1a receptor HTR1A | Serotonin receptor 1A
Type:
Mol. Mass.:
46122.49
Organism:
Homo sapiens (Human)
Description:
Residue:
422
  
Inhibitor
Name:
BDBM50228648
Synonyms:
5,7-dichloro-3-(3-hydroxyphenyl)-3-methylquinoline-2,4(1H,3H)-dione | CHEMBL404352
Type:
Small organic molecule
Emp. Form.:
C16H11Cl2NO3
Mol. Mass.:
336.169
SMILES:
CC1(C(=O)Nc2cc(Cl)cc(Cl)c2C1=O)c1cccc(O)c1
: