Target
5-hydroxytryptamine receptor 6
Ligand
BDBM28583
Substrate
Meas. Tech.
ChEMBL_461681 (CHEMBL927702)
Ki
1±n/a nM
Citation
 Seong, CMPark, WKPark, CMKong, JYPark, NS Discovery of 3-aryl-3-methyl-1H-quinoline-2,4-diones as a new class of selective 5-HT6 receptor antagonists. Bioorg Med Chem Lett 18:738-43 (2008)  
Target
Name:
5-hydroxytryptamine receptor 6
Synonyms:
5-HT-6 5-hydroxytryptamine receptor 6 (5-HT-6) 5-hydroxytryptamine receptor 6 (5HT6) HTR6 Serotonin 6 (5-HT6) receptor | Serotonin Receptor 6
Type:
G Protein-Coupled Receptor (GPCR)
Mol. Mass.:
46968.43
Organism:
Homo sapiens (Human)
Description:
P50406
Residue:
440
  
Inhibitor
Name:
BDBM28583
Synonyms:
5-chloro-N-[4-methoxy-3-(piperazin-1-yl)phenyl]-3-methyl-1-benzothiophene-2-sulfonamide hydrochloride SB 271046 | SB-271046
Type:
Small organic molecule
Emp. Form.:
C20H22ClN3O3S2
Mol. Mass.:
451.99
SMILES:
COc1ccc(NS(=O)(=O)c2sc3ccc(Cl)cc3c2C)cc1N1CCNCC1
: