Target
5-hydroxytryptamine receptor 7
Ligand
BDBM28583
Substrate
Meas. Tech.
ChEMBL_461685 (CHEMBL927706)
Ki
260±n/a nM
Citation
 Seong, CMPark, WKPark, CMKong, JYPark, NS Discovery of 3-aryl-3-methyl-1H-quinoline-2,4-diones as a new class of selective 5-HT6 receptor antagonists. Bioorg Med Chem Lett 18:738-43 (2008)  
Target
Name:
5-hydroxytryptamine receptor 7
Synonyms:
5-HT-7 5-HT7 5-HT7S 5HT7 HTR7 | Serotonin receptor 7
Type:
G Protein-Coupled Receptor (GPCR)
Mol. Mass.:
53573.08
Organism:
Homo sapiens (Human)
Description:
P34969
Residue:
479
  
Inhibitor
Name:
BDBM28583
Synonyms:
5-chloro-N-[4-methoxy-3-(piperazin-1-yl)phenyl]-3-methyl-1-benzothiophene-2-sulfonamide hydrochloride SB 271046 | SB-271046
Type:
Small organic molecule
Emp. Form.:
C20H22ClN3O3S2
Mol. Mass.:
451.99
SMILES:
COc1ccc(NS(=O)(=O)c2sc3ccc(Cl)cc3c2C)cc1N1CCNCC1
: