Target
5-hydroxytryptamine receptor 7
Ligand
BDBM50228648
Substrate
Meas. Tech.
ChEMBL_461685 (CHEMBL927706)
Ki
>10000±n/a nM
Citation
 Seong, CMPark, WKPark, CMKong, JYPark, NS Discovery of 3-aryl-3-methyl-1H-quinoline-2,4-diones as a new class of selective 5-HT6 receptor antagonists. Bioorg Med Chem Lett 18:738-43 (2008)  
Target
Name:
5-hydroxytryptamine receptor 7
Synonyms:
5-HT-7 5-HT7 5-HT7S 5HT7 HTR7 | Serotonin receptor 7
Type:
G Protein-Coupled Receptor (GPCR)
Mol. Mass.:
53573.08
Organism:
Homo sapiens (Human)
Description:
P34969
Residue:
479
  
Inhibitor
Name:
BDBM50228648
Synonyms:
5,7-dichloro-3-(3-hydroxyphenyl)-3-methylquinoline-2,4(1H,3H)-dione | CHEMBL404352
Type:
Small organic molecule
Emp. Form.:
C16H11Cl2NO3
Mol. Mass.:
336.169
SMILES:
CC1(C(=O)Nc2cc(Cl)cc(Cl)c2C1=O)c1cccc(O)c1
: