Target
Histone deacetylase 5
Ligand
BDBM50229197
Substrate
Meas. Tech.
ChEMBL_461759 (CHEMBL927765)
IC50
>50000±n/a nM
Citation
 Witter, DJHarrington, PWilson, KJChenard, MFleming, JCHaines, BKral, AMSecrist, JPMiller, TA Optimization of biaryl Selective HDAC1&2 Inhibitors (SHI-1:2). Bioorg Med Chem Lett 18:726-31 (2008)  
Target
Name:
Histone deacetylase 5
Synonyms:
Antigen NY-CO-9 HDAC5 Histone acetylase 5 (HDAC5) Human HDAC5 | KIAA0600
Type:
Enzyme
Mol. Mass.:
121968.61
Organism:
Homo sapiens (Human)
Description:
Q9UQL6
Residue:
1122
  
Inhibitor
Name:
BDBM50229197
Synonyms:
CHEMBL399494 ethyl 4-((2-amino-5-(thiophen-2-yl)phenyl)carbamoyl)benzylcarbamate
Type:
Small organic molecule
Emp. Form.:
C21H21N3O3S
Mol. Mass.:
395.475
SMILES:
CCOC(=O)NCc1ccc(cc1)C(=O)Nc1cc(ccc1N)-c1cccs1
: