Target
Histone deacetylase 1
Ligand
BDBM50229198
Substrate
Meas. Tech.
ChEMBL_461755 (CHEMBL927761)
IC50
16±n/a nM
Citation
 Witter, DJHarrington, PWilson, KJChenard, MFleming, JCHaines, BKral, AMSecrist, JPMiller, TA Optimization of biaryl Selective HDAC1&2 Inhibitors (SHI-1:2). Bioorg Med Chem Lett 18:726-31 (2008)  
Target
Name:
Histone deacetylase 1
Synonyms:
Cereblon/Histone deacetylase 1 HDAC1 Histone deacetylase 1 (HDAC1) RPD3L1
Type:
Enzyme
Mol. Mass.:
55090.27
Organism:
Homo sapiens (Human)
Description:
Q13547
Residue:
482
  
Inhibitor
Name:
BDBM50229198
Synonyms:
CHEMBL400044 [4-(4-amino-biphenyl-3-ylcarbamoyl)-benzyl]-carbamic acid phenyl ester
Type:
Small organic molecule
Emp. Form.:
C27H23N3O3
Mol. Mass.:
437.4898
SMILES:
Nc1ccc(cc1NC(=O)c1ccc(CNC(=O)Oc2ccccc2)cc1)-c1ccccc1
: