Target
Histone deacetylase 2
Ligand
BDBM50229197
Substrate
Meas. Tech.
ChEMBL_461756 (CHEMBL927762)
IC50
71±n/a nM
Citation
 Witter, DJHarrington, PWilson, KJChenard, MFleming, JCHaines, BKral, AMSecrist, JPMiller, TA Optimization of biaryl Selective HDAC1&2 Inhibitors (SHI-1:2). Bioorg Med Chem Lett 18:726-31 (2008)  
Target
Name:
Histone deacetylase 2
Synonyms:
Cereblon/Histone deacetylase 2 HDAC2 Histone deacetylase 2 (HDAC2) | Human HDAC2
Type:
Chromatin regulator; hydrolase; repressor
Mol. Mass.:
55356.54
Organism:
Homo sapiens (Human)
Description:
Q92769
Residue:
488
  
Inhibitor
Name:
BDBM50229197
Synonyms:
CHEMBL399494 ethyl 4-((2-amino-5-(thiophen-2-yl)phenyl)carbamoyl)benzylcarbamate
Type:
Small organic molecule
Emp. Form.:
C21H21N3O3S
Mol. Mass.:
395.475
SMILES:
CCOC(=O)NCc1ccc(cc1)C(=O)Nc1cc(ccc1N)-c1cccs1
: