Target
Histone deacetylase 7
Ligand
BDBM19410
Substrate
Meas. Tech.
ChEMBL_461761 (CHEMBL927767)
IC50
>50000±n/a nM
Citation
 Witter, DJHarrington, PWilson, KJChenard, MFleming, JCHaines, BKral, AMSecrist, JPMiller, TA Optimization of biaryl Selective HDAC1&2 Inhibitors (SHI-1:2). Bioorg Med Chem Lett 18:726-31 (2008)  
Target
Name:
Histone deacetylase 7
Synonyms:
HD7 HDAC7A Histone acetylase 7 (HDAC7) Human HDAC7
Type:
Chromatin regulator; hydrolase; repressor
Mol. Mass.:
102942.62
Organism:
Homo sapiens (Human)
Description:
Q8WUI4
Residue:
952
  
Inhibitor
Name:
BDBM19410
Synonyms:
CHEMBL27759 US11377423, MS-275 US9265734, MS-275 benzamide-type inhibitor, 3 | pyridin-3-ylmethyl N-({4-[(2-aminophenyl)carbamoyl]phenyl}methyl)carbamate
Type:
Small organic molecule
Emp. Form.:
C21H20N4O3
Mol. Mass.:
376.4085
SMILES:
Nc1ccccc1NC(=O)c1ccc(CNC(=O)OCc2cccnc2)cc1
: