Target
Peroxisome proliferator-activated receptor delta
Ligand
BDBM50229206
Substrate
Meas. Tech.
ChEMBL_461777 (CHEMBL927783)
EC50
300±n/a nM
Citation
 Faucher, NMartres, PLaroze, APineau, OPotvain, FGrillot, D Design, synthesis and evaluation of trifluoromethane sulfonamide derivatives as new potent and selective peroxisome proliferator-activated receptor alpha agonists. Bioorg Med Chem Lett 18:710-5 (2008)  
Target
Name:
Peroxisome proliferator-activated receptor delta
Synonyms:
NUC1 Nuclear hormone receptor 1 PPAR-beta PPARD_MOUSE Ppard
Type:
PROTEIN
Mol. Mass.:
49719.14
Organism:
Mus musculus
Description:
ChEMBL_1288931
Residue:
440
  
Inhibitor
Name:
BDBM50229206
Synonyms:
CHEMBL253310 | N-(4-(trifluoromethylsulfonamido)benzyl)-4-methyl-2-(4-(trifluoromethyl)phenyl)thiazole-5-carboxamide
Type:
Small organic molecule
Emp. Form.:
C20H15F6N3O3S2
Mol. Mass.:
523.472
SMILES:
Cc1nc(sc1C(=O)NCc1ccc(NS(=O)(=O)C(F)(F)F)cc1)-c1ccc(cc1)C(F)(F)F
: