Target
5-hydroxytryptamine receptor 1A
Ligand
BDBM50231441
Substrate
Meas. Tech.
ChEMBL_461982 (CHEMBL944825)
Ki
2±n/a nM
Citation
 Graham, JMCoughenour, LLBarr, BMRock, DLNikam, SS 1-Aminoindanes as novel motif with potential atypical antipsychotic properties. Bioorg Med Chem Lett 18:489-93 (2008)  
Target
Name:
5-hydroxytryptamine receptor 1A
Synonyms:
5-HT-1A 5-hydroxytryptamine receptor 1A (5-HT-1A) ADRB2RL1 Dopamine D2 receptor and serotonin 1a receptor HTR1A | Serotonin receptor 1A
Type:
Mol. Mass.:
46122.49
Organism:
Homo sapiens (Human)
Description:
Residue:
422
  
Inhibitor
Name:
BDBM50231441
Synonyms:
CHEMBL252031 | N-(5-(2-(4-(benzo[d]isothiazol-3-yl)piperazin-1-yl)ethyl)-2,3-dihydro-1H-inden-1-yl)propionamide
Type:
Small organic molecule
Emp. Form.:
C25H30N4OS
Mol. Mass.:
434.597
SMILES:
CCC(=O)NC1CCc2cc(CCN3CCN(CC3)c3nsc4ccccc34)ccc12
: