Target
Beta-secretase 1
Ligand
BDBM50231504
Substrate
Meas. Tech.
ChEMBL_462005 (CHEMBL944848)
IC50
1400±n/a nM
Citation
 Cole, DCStock, JRChopra, RCowling, REllingboe, JWFan, KYHarrison, BLHu, YJacobsen, SJennings, LDJin, GLohse, PAMalamas, MSManas, ESMoore, WJO'Donnell, MMOlland, AMRobichaud, AJSvenson, KWu, JWagner, EBard, J Acylguanidine inhibitors of beta-secretase: optimization of the pyrrole ring substituents extending into the S1 and S3 substrate binding pockets. Bioorg Med Chem Lett 18:1063-6 (2008)  
Target
Name:
Beta-secretase 1
Synonyms:
ASP2 Aspartyl protease 2 BACE1 Beta-secretase (BACE) Beta-secretase 1 (BACE 1) Beta-secretase 1 (BACE1) Beta-site amyloid precursor protein cleaving enzyme 1 Memapsin-2 beta-Secretase (BACE-1) | beta-Secretase (BACE1)
Type:
Protein
Mol. Mass.:
55755.10
Organism:
Homo sapiens (Human)
Description:
P56817
Residue:
501
  
Inhibitor
Name:
BDBM50231504
Synonyms:
CHEMBL252025 | N-{2-[2-(4-fluoro-phenyl)-5-(4-phenoxy-phenyl)-pyrrol-1-yl]-acetyl}-guanidine
Type:
Small organic molecule
Emp. Form.:
C25H21FN4O2
Mol. Mass.:
428.4582
SMILES:
NC(=N)NC(=O)Cn1c(ccc1-c1ccc(Oc2ccccc2)cc1)-c1ccc(F)cc1
: